Result

WA

Duration

507ms

Code [DL]

00000000  53 45 43 54 49 4f 4e 20  2e 62 73 73 0a 78 20 72  |SECTION .bss.x r|
00000010  65 73 62 20 34 0a 61 20  72 65 73 74 20 34 0a 53  |esb 4.a rest 4.S|
00000020  45 43 54 49 4f 4e 20 2e  74 65 78 74 0a 64 62 20  |ECTION .text.db |
00000030  60 8a 1d 00 00 00 00 80  fb 0b 7f 66 66 53 66 ba  |`..........ffSf.|
00000040  03 00 b9 18 00 00 00 66  bb 00 00 66 b8 03 00 cd  |.......f...f....|
00000050  80 66 5b 0f be 05 18 00  00 00 b2 5c 6e 83 e8 30  |.f[........\n..0|
00000060  0f af c2 8a 15 19 00 00  00 8d 44 10 e2 88 83 04  |..........D.....|
00000070  00 00 00 66 8b 1d 00 00  00 00 b1 03 66 0f be c3  |...f........f...|
00000080  89 da f6 f9 80 fb 02 0f  be cc 0f 9f c0 66 42 f6  |.............fB.|
00000090  a1 04 00 00 00 88 15 00  00 00 00 28 83 04 00 00  |...........(....|
000000a0  00 eb 8f 0f be 1d 0c 00  00 00 0f be 3d 0e 00 00  |............=...|
000000b0  00 0f be 35 0f 00 00 00  0f be 0d 5c 6e 00 00 00  |...5.......\n...|
000000c0  66 0f be 05 0d 00 00 00  89 da 0f af d7 66 a3 04  |f............f..|
000000d0  00 00 00 0f be 05 0b 00  00 00 a3 00 00 00 00 66  |...............f|
000000e0  0f af 1d 04 00 00 00 0f  af c6 29 d0 0f be 15 07  |..........).....|
000000f0  00 00 00 0f af f1 0f af  cf 29 f3 0f be 35 08 00  |.........)...5..|
00000100  00 00 0f af d0 a1 00 00  00 00 66 0f af 05 04 00  |..........f.....|
00000110  00 00 0f af de 0f be 35  09 00 00 00 01 d3 29 c1  |.......5......).|
00000120  0f af ce 8d 04 0b 99 b9  06 00 00 00 f7 f9 50 e8  |..............P.|
00000130  01 00 00 00 c3 55 89 e5  53 8b 55 08 66 85 d2 74  |.....U..S.U.f..t|
00000140  33 b9 5c 6e 00 00 00 89  d0 31 d2 66 f7 f1 89 d3  |3.\n.....1.f....|
00000150  50 e8 e0 ff ff ff 66 8d  43 30 a2 04 00 00 00 66  |P.....f.C0.....f|
00000160  ba 01 00 b9 04 00 00 00  66 bb 01 00 66 b8 04 00  |........f...f...|
00000170  cd 80 83 c4 10 8b 5d fc  c9 c3 60                 |......]...`|
0000017b

stdin

84 52 50
06 53 55
45 68 22
32 19 83

stdout

stderr

/tmp/code.asm:5: error: expression syntax error
/tmp/code.asm:6: error: label or instruction expected at start of line
gcc: error: /tmp/code.o: No such file or directory
gcc: fatal error: no input files
compilation terminated.
/bin/script: 16: /bin/script: /tmp/code: not found
rm: cannot remove '/tmp/code.o': No such file or directory
rm: cannot remove '/tmp/code': No such file or directory